Avatar

Please consider registering
guest

sp_LogInOut Log In sp_Registration Register

Register | Lost password?
Advanced Search

— Forum Scope —




— Match —





— Forum Options —





Minimum search word length is 3 characters - maximum search word length is 84 characters

sp_Feed Topic RSS sp_TopicIcon
Issues building MiniSynth
Avatar
Jonas
New Member
Members
January 24, 2019 - 9:09 am
Member Since: January 24, 2019
Forum Posts: 1
sp_UserOfflineSmall Offline

Hi,

Im on Windows 10 with RackAFX version 6.9.3.0, VST 3 version 3.6.10 trying to build MiniSynth in Visual Studio 2017 Community as VST3 plugin, but get these errors:

9>[Scan Parameters]
9>Info: ===Scan Parameters ====================================
9>Info: This component exports 50 parameter(s)
9>Info: Param 000 (ID = 0): [title="Voice Mode"] [unit=""] [type = D, default = 0.000000, unit = 0]
9>Info: Param 001 (ID = 1): [title="Detune"] [unit="cnts"] [type = F, default = 0.500000, unit = 0]
9>Info: Param 002 (ID = 2): [title="Filter fc"] [unit="Hz"] [type = F, default = 0.891481, unit = 0]
9>Info: Param 003 (ID = 3): [title="LFO Rate"] [unit="Hz"] [type = F, default = 0.024024, unit = 0]
9>Info: Param 004 (ID = 4): [title="Attack"] [unit="mS"] [type = F, default = 0.020000, unit = 0]
9>Info: Param 005 (ID = 5): [title="Pulse Width"] [unit="%"] [type = F, default = 0.500000, unit = 0]
9>Info: Param 006 (ID = 6): [title="Dly Time"] [unit="mS"] [type = F, default = 0.000000, unit = 0]
9>Info: Param 007 (ID = 7): [title="Feedbck"] [unit="%"] [type = F, default = 0.500000, unit = 0]
9>Info: Param 008 (ID = 8): [title="Dly Ratio"] [unit=""] [type = F, default = 0.500000, unit = 0]
9>Info: Param 009 (ID = 9): [title="Delay Mix"] [unit=""] [type = F, default = 0.500000, unit = 0]
9>Info: Param 010 (ID = 10): [title="Octave"] [unit=""] [type = F, default = 0.500000, unit = 0]
9>Info: Param 011 (ID = 11): [title="Glide"] [unit="mS"] [type = F, default = 0.000000, unit = 0]
9>EXEC : error : Param 012: defaultValue is not normalized!!!
9>[XXXXXXX Failed]
9>
.
.
.
9>
9>-------------------------------------------------------------
9>Result: 38 tests passed, 1 tests failed
9>-------------------------------------------------------------
9>C:\Program Files (x86)\Microsoft Visual Studio\2017\Community\Common7\IDE\VC\VCTargets\Microsoft.CppCommon.targets(138,5): error MSB3073: The command "setlocal
9>C:\Program Files (x86)\Microsoft Visual Studio\2017\Community\Common7\IDE\VC\VCTargets\Microsoft.CppCommon.targets(138,5): error MSB3073: cd C:\VST_SDK\VST3_SDK\myprojects\mini\win_build\bin
9>C:\Program Files (x86)\Microsoft Visual Studio\2017\Community\Common7\IDE\VC\VCTargets\Microsoft.CppCommon.targets(138,5): error MSB3073: if %errorlevel% neq 0 goto :cmEnd
9>C:\Program Files (x86)\Microsoft Visual Studio\2017\Community\Common7\IDE\VC\VCTargets\Microsoft.CppCommon.targets(138,5): error MSB3073: C:
9>C:\Program Files (x86)\Microsoft Visual Studio\2017\Community\Common7\IDE\VC\VCTargets\Microsoft.CppCommon.targets(138,5): error MSB3073: if %errorlevel% neq 0 goto :cmEnd
9>C:\Program Files (x86)\Microsoft Visual Studio\2017\Community\Common7\IDE\VC\VCTargets\Microsoft.CppCommon.targets(138,5): error MSB3073: C:\VST_SDK\VST3_SDK\myprojects\mini\win_build\bin\Debug\validator.exe C:/VST_SDK/VST3_SDK/myprojects/mini/win_build/VST3/Debug/mini.vst3/Contents/x86_64-win/mini.vst3
9>C:\Program Files (x86)\Microsoft Visual Studio\2017\Community\Common7\IDE\VC\VCTargets\Microsoft.CppCommon.targets(138,5): error MSB3073: if %errorlevel% neq 0 goto :cmEnd
9>C:\Program Files (x86)\Microsoft Visual Studio\2017\Community\Common7\IDE\VC\VCTargets\Microsoft.CppCommon.targets(138,5): error MSB3073: :cmEnd
9>C:\Program Files (x86)\Microsoft Visual Studio\2017\Community\Common7\IDE\VC\VCTargets\Microsoft.CppCommon.targets(138,5): error MSB3073: endlocal & call :cmErrorLevel %errorlevel% & goto :cmDone
9>C:\Program Files (x86)\Microsoft Visual Studio\2017\Community\Common7\IDE\VC\VCTargets\Microsoft.CppCommon.targets(138,5): error MSB3073: :cmErrorLevel
9>C:\Program Files (x86)\Microsoft Visual Studio\2017\Community\Common7\IDE\VC\VCTargets\Microsoft.CppCommon.targets(138,5): error MSB3073: exit /b %1
9>C:\Program Files (x86)\Microsoft Visual Studio\2017\Community\Common7\IDE\VC\VCTargets\Microsoft.CppCommon.targets(138,5): error MSB3073: :cmDone
9>C:\Program Files (x86)\Microsoft Visual Studio\2017\Community\Common7\IDE\VC\VCTargets\Microsoft.CppCommon.targets(138,5): error MSB3073: if %errorlevel% neq 0 goto :VCEnd
9>C:\Program Files (x86)\Microsoft Visual Studio\2017\Community\Common7\IDE\VC\VCTargets\Microsoft.CppCommon.targets(138,5): error MSB3073: setlocal
9>C:\Program Files (x86)\Microsoft Visual Studio\2017\Community\Common7\IDE\VC\VCTargets\Microsoft.CppCommon.targets(138,5): error MSB3073: C:\CMake\bin\cmake.exe -E copy C:/VST_SDK/VST3_SDK/myprojects/mini/project_source/cmake/vst_cmake/../../resources/RackAFX.uidesc C:/VST_SDK/VST3_SDK/myprojects/mini/win_build/VST3/Debug/mini.vst3/Contents/Resources
9>C:\Program Files (x86)\Microsoft Visual Studio\2017\Community\Common7\IDE\VC\VCTargets\Microsoft.CppCommon.targets(138,5): error MSB3073: if %errorlevel% neq 0 goto :cmEnd
.
.
.
9>C:\Program Files (x86)\Microsoft Visual Studio\2017\Community\Common7\IDE\VC\VCTargets\Microsoft.CppCommon.targets(138,5): error MSB3073: :cmEnd
9>C:\Program Files (x86)\Microsoft Visual Studio\2017\Community\Common7\IDE\VC\VCTargets\Microsoft.CppCommon.targets(138,5): error MSB3073: endlocal & call :cmErrorLevel %errorlevel% & goto :cmDone
9>C:\Program Files (x86)\Microsoft Visual Studio\2017\Community\Common7\IDE\VC\VCTargets\Microsoft.CppCommon.targets(138,5): error MSB3073: :cmErrorLevel
9>C:\Program Files (x86)\Microsoft Visual Studio\2017\Community\Common7\IDE\VC\VCTargets\Microsoft.CppCommon.targets(138,5): error MSB3073: exit /b %1
9>C:\Program Files (x86)\Microsoft Visual Studio\2017\Community\Common7\IDE\VC\VCTargets\Microsoft.CppCommon.targets(138,5): error MSB3073: :cmDone
9>C:\Program Files (x86)\Microsoft Visual Studio\2017\Community\Common7\IDE\VC\VCTargets\Microsoft.CppCommon.targets(138,5): error MSB3073: if %errorlevel% neq 0 goto :VCEnd
9>C:\Program Files (x86)\Microsoft Visual Studio\2017\Community\Common7\IDE\VC\VCTargets\Microsoft.CppCommon.targets(138,5): error MSB3073: :VCEnd" exited with code -1.
9>Done building project "mini.vcxproj" -- FAILED.
10>------ Rebuild All started: Project: ALL_BUILD, Configuration: Debug x64 ------
10>Building Custom Rule C:/VST_SDK/VST3_SDK/myprojects/mini/CMakeLists.txt
10>CMake does not need to re-run because C:/VST_SDK/VST3_SDK/myprojects/mini/win_build/CMakeFiles/generate.stamp is up-to-date.
========== Rebuild All: 9 succeeded, 1 failed, 0 skipped ==========

I've tried this http://www.willpirkle.com/forum/cmake-aax-au-vst-exporting/exporting-windows-projects-windows-runtime/ and I've followed the cmake instructions carefully.

Any suggestions? Smile 

Avatar
W Pirkle
Admin
February 7, 2019 - 11:02 am
Member Since: January 29, 2017
Forum Posts: 332
sp_UserOfflineSmall Offline

There is a new validation routine that the RackAFX exclusive taper for Volt-Octave was failing. Until I can release a patch, you can fix this pretty easily by downloading two files here and overwriting them in your project - just follow the instructions in readme.txt to overwrite the two files VoltOctaveParameter.h and VoltOctaveParameter.cpp in the appropriate folder. 

http://willpirkle.com/Download.....ramFix.zip

I have tested this with VS2015 and VS2017 without problems - validation now passes with flying colors.

- Will

Forum Timezone: America/New_York

Most Users Ever Online: 55

Currently Online:
5 Guest(s)

Currently Browsing this Page:
1 Guest(s)

Top Posters:

Skyler: 48

Derek: 46

Frodson: 45

Peter: 41

clau_ste: 39

JimmyM: 32

Gwen: 32

TheSmile: 30

EZB: 24

lppier: 23

Member Stats:

Guest Posters: 1

Members: 563

Moderators: 1

Admins: 4

Forum Stats:

Groups: 12

Forums: 36

Topics: 576

Posts: 2298

Newest Members:

Wanderer, mister1234, Evan Galvanek, Rowan Fraser, patrickbarr1984, Ray C., Jon R., Pat, Jan, Ben_1

Moderators: W Pirkle: 332

Administrators: Tom: 69, JD Young: 80, Will Pirkle: 0, W Pirkle: 332